Show Posts

This section allows you to view all posts made by this member. Note that you can only see posts made in areas you currently have access to.


Messages - TeLLie

Pages: [1] 2 3 ... 12
1
Programming / Re: Qt6
« on: November 29, 2022, 01:14:40 pm »
Hi

As i told before here it starts from every dit i tried

It traps as soon i choose for icons under

2
Programming / Re: Qt6
« on: November 28, 2022, 05:48:43 pm »
HI Dave,

Did you try to del the conf file in the /home/.config
I notice if i set the icon under text that it failed here also.
Also i see no icons ...

3
Programming / Re: Qt6
« on: November 25, 2022, 08:23:48 am »
Hi Paul,

Thankz for the newer build :)
Need i to recompile all with the newer cmake or just the multimedia ?

And have fun in you're holidayhouse :P

4
Programming / Re: Qt6
« on: November 23, 2022, 12:00:03 am »
Hi PAul,

What should i do rebuild without QtShaderTools
Or any other suggestion?

5
Programming / Re: Qt6
« on: November 22, 2022, 05:19:43 pm »
Hi PAul,

On several programs i get this in popup.log

11-22-2022  17:14:44  SYS2070  PID 0295  TID 0001  Slot 007a
F:\QT6_SOURCE\FOCUSWRITER-1.8.3\CMAKE-1220\FOCUSWRITER.EXE
QT6QUIC6->QT6QUIC6.__ZN20QQuickFileNameFilter16staticMetaObjectE
127

I see its in Qt6Quic6.dll and Qt6QuickDialogs2Utils_dll.a
If i add the .a to exe file its still show this error in popup

Also.....
H:\usr\local1220\lib>chkdll32 Qt6Quic6.dll
Loading DLL 'libcn0' --> C:\USR\LIB\LIBCN0.DLL.
Loading DLL 'Qt6Gui6' --> H:\USR\LOCAL1220\LIB\QT6GUI6.DLL.
Loading DLL 'Qt6Core6' --> H:\USR\LOCAL1220\LIB\QT6CORE6.DLL.
Loading DLL 'Qt6Quic6' --> NOT loaded!
DosExit or exception while loading 'Qt6Quic6'.
Loading DLL 'Qt6Qml6' --> H:\USR\LOCAL1220\LIB\QT6QML6.DLL.
Loading DLL 'gcc1' --> C:\USR\LIB\GCC1.DLL.

and

[chkdll32 Qt6Mult6.dll]

Loading DLL 'libcn0' --> C:\USR\LIB\LIBCN0.DLL.
Loading DLL 'Qt6Core6' --> H:\USR\LOCAL1220\LIB\QT6CORE6.DLL.
Loading DLL 'Qt6Mult6' --> NOT loaded!
DosExit or exception while loading 'Qt6Mult6'.
Loading DLL 'Qt6Qml6' --> H:\USR\LOCAL1220\LIB\QT6QML6.DLL.
Loading DLL 'Qt6Gui6' --> H:\USR\LOCAL1220\LIB\QT6GUI6.DLL.
Loading DLL 'Qt6Quic6' --> H:\USR\LOCAL1220\LIB\QT6QUIC6.DLL.
Unable to load procedure from Qt6Quic6 (file: H:\USR\LOCAL1220\LIB\QT6QUIC6.DLL)
Entry '__ZNK10QSGTexture16removedFromAtlasEP23QRhiResourceUpdateBatch' could not be resolved.
DosQueryProcAddr returned: 127
Unable to load procedure from Qt6Quic6 (file: H:\USR\LOCAL1220\LIB\QT6QUIC6.DLL)
Entry '__ZNK10QSGTexture14isAtlasTextureEv' could not be resolved.
DosQueryProcAddr returned: 127
Unable to load procedure from Qt6Quic6 (file: H:\USR\LOCAL1220\LIB\QT6QUIC6.DLL)
Entry '__ZNK10QSGTexture24normalizedTextureSubRectEv' could not be resolved.
DosQueryProcAddr returned: 127
Unable to load procedure from Qt6Quic6 (file: H:\USR\LOCAL1220\LIB\QT6QUIC6.DLL)
Entry '__ZN10QSGTexture11qt_metacallEN11QMetaObject4CallEiPPv' could not be resolved.
DosQueryProcAddr returned: 127
Unable to load procedure from Qt6Quic6 (file: H:\USR\LOCAL1220\LIB\QT6QUIC6.DLL)

Seems there some wrong ???

Btw do you see same  or...
If not could you zip up al youre dll and .a


6
Programming / Re: Qt6
« on: November 22, 2022, 07:15:49 am »
Hi Paul

I compile several progs
Some worked some didn't but what i notice to the ones that compiled with qt6 so far is that the tabs from the menubar Are not looking fine, as it's not showing all lines.
Look add linguïst or designer. When home i put some here so peeps can test...

7
Programming / Re: Qt6
« on: November 21, 2022, 08:31:01 am »
F:\qt6\lib>helloworldgui.exe
qt.qpa.plugin: Could not find the Qt platform plugin "os2" in ""
This application failed to start because no Qt platform plugin could be initialized. Reinstalling the application may fix this problem.

Is the information in this ticket maybe useful? https://github.com/bitwiseworks/qtbase-os2/issues/77

Nope, there was just something wrong with Tellie's environment. Most likely, he didnt rerun the configuration script to pickup changes that had been made to correctly detect dlopen support on OS/2.

Cheers,

Paul.

Yes where the env....


8
Programming / Re: Qt6
« on: November 20, 2022, 11:00:02 pm »
Hi Dave

Used gcc 1220

9
Programming / Re: Qt6
« on: November 20, 2022, 09:47:16 pm »
Hi
Finaly i got it working :)


10
Programming / Re: Qt6
« on: November 20, 2022, 02:56:14 pm »
Hi Paul,
Have to correct my previous answer about you're build, thats working.

But i did a clean build and then install it to g:/qt6 but its still says it cannot find plugin

Is there some change that you dint push yet or?

I tried to compile qt6-declarative-os2
Had to compile qt6-shadertools-os2 first
That build fine.

But if i search on the link error i see thats the error inside the Qt6Shad6.dll but not in the .a file.


file D:\temp\ldconv_libstdc++_a_2997637a5b1a199520.lib(cxx11-ios_failure.obj): undefined symbol __ZNSt12system_errorC2ESt10error_codeRKNSt7__cxx1112basic_stringIcSt11char_traitsIcESaIcEEE
file D:\temp\ldconv_libstdc++_a_2997637a5b1a199520.lib(cxx11-ios_failure.obj): undefined symbol __ZNSt12system_errorC2ESt10error_codePKc

11
Programming / Re: Qt6
« on: November 20, 2022, 11:16:56 am »
Hi Paul,

I rebuild it with the latest changes you make but it still asked for the os2 plugin.
Did you do something others or??

I also tried you're build and see same...
F:\qt6\lib>helloworldgui.exe
qt.qpa.plugin: Could not find the Qt platform plugin "os2" in ""
This application failed to start because no Qt platform plugin could be initialized. Reinstalling the application may fix this problem.


12
Programming / Re: Qt6
« on: November 19, 2022, 01:05:51 pm »
Hi all,
After a recompile the build succeed :)

INstall went fine, but also complains that it cannot find the OS2 platform plugin

So far so good :P

qTorrent\qt6>G:\qt6\bin\qmake6.exe -r ../
Cannot find feature spec_pre.prf
Error processing project file: ..\qTorrent.pro

So it seems the structure for qt6 is not good, or unfindable ?

Also notice that qt6 have .a instead of .lib
I have build now iqpuzzle-1.2.7
Had to change some things in the qt6 build structure
Like add a qt6/libexec and copy there the uic moc and rcc file

g:/qt6/mkspecs/features/toolchain.prf:76: Variable QMAKE_CXX.COMPILER_MACROS is not defined.
Project ERROR: failed to parse default search paths from compiler output

This get fixed if i copy a  .qmake.stash in root of the dir
Then it complains @ make: *** No rule to make target `g:/qt6/lib/Qt6Widgets.lib', needed by `iQPuzzle.exe'.  Stop
change in makefile the lib to qt6widgets_dll.a that solved this error
But after compiling it still ask for the os2 platform plugin...

F:\iqpuzzle-1.2.7\qmake1220-os2>chkdll32 iQPuzzle.exe
Loading DLL 'libcn0' --> C:\USR\LIB\LIBCN0.DLL.
Loading DLL 'libcx0' --> C:\USR\LIB\LIBCX0.DLL.
Loading DLL 'Qt6Core6' --> G:\QT6\LIB\QT6CORE6.DLL.
Loading DLL 'gcc1' --> C:\USR\LIB\GCC1.DLL.
Loading DLL 'Qt6Widg6' --> G:\QT6\LIB\QT6WIDG6.DLL.
Loading DLL 'Qt6Gui6' --> G:\QT6\LIB\QT6GUI6.DLL.
Loading DLL 'stdcpp6' --> C:\USR\LIB\STDCPP6.DLL.
All DLL's used by 'iQPuzzle.exe' could be loaded.


13
Programming / Re: Qt6
« on: November 19, 2022, 01:03:37 pm »
Hi all,
After a recompile the build succeed :)

INstall went fine, but also complains that it cannot find the OS2 platform plugin

So far so good :P

qTorrent\qt6>G:\qt6\bin\qmake6.exe -r ../
Cannot find feature spec_pre.prf
Error processing project file: ..\qTorrent.pro

So it seems the structure for qt6 is not good, or unfindable ?

Also notice that qt6 have .a instead of .lib
I have build now iqpuzzle-1.2.7
Had to change some things in the qt6 build structure
Like add a qt6/libexec and copy there the uic moc and rcc file

g:/qt6/mkspecs/features/toolchain.prf:76: Variable QMAKE_CXX.COMPILER_MACROS is not defined.
Project ERROR: failed to parse default search paths from compiler output

This get fixed if i copy a  .qmake.stash in root of the dir
Then it complains @ make: *** No rule to make target `g:/qt6/lib/Qt6Widgets.lib', needed by `iQPuzzle.exe'.  Stop
change in makefile the lib to qt6widgets_dll.a that solved this error
But after compiling it still ask for the os2 platform plugin...

14
Programming / Re: Qt6
« on: November 19, 2022, 11:11:51 am »
Hi all,
After a recompile the build succeed :)

INstall went fine, but also complains that it cannot find the OS2 platform plugin

So far so good :P

qTorrent\qt6>G:\qt6\bin\qmake6.exe -r ../
Cannot find feature spec_pre.prf
Error processing project file: ..\qTorrent.pro

So it seems the structure for qt6 is not good, or unfindable ?

15
Programming / Re: Qt6
« on: November 19, 2022, 12:26:07 am »
Hihi

I get same error now to...

G:/qt6-dev/src/printsupport/PrintSupport_autogen/2NRMJ5X7RK/moc_qprintdialog.cpp:93:29: error: invalid use of incomplete type 'class QPrintDialogPrivate'
   93 |         case 1: _t->d_func()->_q_togglePageSetCombo((*reinterpret_cast< std::add_pointer_t<bool>>(_a[1]))); break;
      |                             ^~
In file included from G:/qt6-dev/src/printsupport/PrintSupport_autogen/2NRMJ5X7RK/moc_qprintdialog.cpp:10:
G:/qt6-os2/src/printsupport/dialogs/qprintdialog.h:51:7: note: forward declaration of 'class QPrintDialogPrivate'
   51 | class QPrintDialogPrivate;
      |       ^~~~~~~~~~~~~~~~~~~
G:/qt6-dev/src/printsupport/PrintSupport_autogen/2NRMJ5X7RK/moc_qprintdialog.cpp:94:29: error: invalid use of incomplete type 'class QPrintDialogPrivate'
   94 |         case 2: _t->d_func()->_q_collapseOrExpandDialog(); break;
      |                             ^~
G:/qt6-os2/src/printsupport/dialogs/qprintdialog.h:51:7: note: forward declaration of 'class QPrintDialogPrivate'
   51 | class QPrintDialogPrivate;
      |       ^~~~~~~~~~~~~~~~~~~
G:/qt6-dev/src/printsupport/PrintSupport_autogen/2NRMJ5X7RK/moc_qprintdialog.cpp:95:29: error: invalid use of incomplete type 'class QPrintDialogPrivate'
   95 |         case 3: _t->d_func()->_q_checkFields(); break;
      |                             ^~
G:/qt6-os2/src/printsupport/dialogs/qprintdialog.h:51:7: note: forward declaration of 'class QPrintDialogPrivate'


BTw...

the latest push you made about #include <QtEventDispatcherSupport/private/qos2guieventdispatcher_p.h>
I get here a error that it could not find file.....
If i change to #include <QtGui/Support/private/qos2guieventdispatcher_p.h>
Then it is ok

Pages: [1] 2 3 ... 12