Show Posts

This section allows you to view all posts made by this member. Note that you can only see posts made in areas you currently have access to.


Messages - R.M. Klippstein

Pages: [1] 2 3 ... 17
1
I've gotten this error on two different machines with ArcaOS 5.0.3 while changing the I.P: for use on my Lan. The I.P changes correctly and all is well, but on rebooting I always get the same error. I've been unable to figure out how to get rid of this error (it actually causes no problems, except for the halt it causes during booting) which is a PITA!
Any ideas would really be appreciated.  Thanks

klipp

2
Applications / Re: Firefox 45.9 XUL.DLL error
« on: March 04, 2019, 01:06:14 am »
Hi Dave, I'm finally back, they put three more "stents" in my heart! Aagghhh!  Yesterday I got back to trying to make Firefox 45.9 once again work, no luck. I gave up went to bed. This morning I got up and went back to work and all 4 machines were waiting for me with Air-Boot waiting for my command (Lost electricity during the night!) I booted up and now Firefox 45.9 works fine?¿?¿ Can't explaine it, Guess best blame it on Mexican electricity here. The voltage here does periodically vary from 105 volts to 130 volts.
Thanks for your assistance once again.
Now I'm back to trying to make DropBox work once again, it worked a couple of years ago but now its back to the "no token found" error.

klipp

3
Applications / Re: Firefox 45.9 XUL.DLL error
« on: February 13, 2019, 03:20:34 am »
Hey Dave, It'll probably be a couple of days before I can get back to you. Gotta go to the hospital (heart Problems) for some tests!
Thanks for the help.

klipp

4
Applications / Re: Firefox 45.9 XUL.DLL error
« on: February 13, 2019, 12:21:08 am »
Hi Dave, Here are the last Firefox entries in popup.log:
02-12-2019  10:22:57  SYS3175  PID 0053  TID 0001  Slot 0079
K:\USR\BIN\FIREFOX.EXE
c0000005
11aca9cb
P1=00000001  P2=0000000c  P3=XXXXXXXX  P4=XXXXXXXX 
EAX=00000000  EBX=16e95b5c  ECX=ffffffff  EDX=00000000
ESI=16e95ae0  EDI=00000000 
DS=0053  DSACC=d0f3  DSLIM=5fffffff 
ES=0053  ESACC=d0f3  ESLIM=5fffffff 
FS=150b  FSACC=00f3  FSLIM=00000030
GS=0000  GSACC=****  GSLIM=********
CS:EIP=005b:164e14f5  CSACC=d0df  CSLIM=5fffffff
SS:ESP=0053:0013ff6c  SSACC=d0f3  SSLIM=5fffffff
EBP=0013ff78  FLG=00010297

PSPRINT.DRV 0001:0001a9cb

------------------------------------------------------------

02-12-2019  11:49:26  SYS3175  PID 0157  TID 0001  Slot 0079
K:\USR\BIN\FIREFOX.EXE
c0000005
11aca9cb
P1=00000001  P2=0000000c  P3=XXXXXXXX  P4=XXXXXXXX 
EAX=00000000  EBX=16d65b5c  ECX=ffffffff  EDX=00000000
ESI=16d65ae0  EDI=00000000 
DS=0053  DSACC=d0f3  DSLIM=5fffffff 
ES=0053  ESACC=d0f3  ESLIM=5fffffff 
FS=150b  FSACC=00f3  FSLIM=00000030
GS=0000  GSACC=****  GSLIM=********
CS:EIP=005b:164514f5  CSACC=d0df  CSLIM=5fffffff
SS:ESP=0053:0013ff64  SSACC=d0f3  SSLIM=5fffffff
EBP=0013ff70  FLG=00010297

PSPRINT.DRV 0001:0001a9cb

Safe mode gives the same error and I've added or installed no plugins. I'm really dumb on browseres,

David G Thanks for the help  I've got RPM installed and rpm'ed firefox-highmem-45.9.0-1.oc00.i686.rpm  and it looks like it installed but can't see where to go to see if it runs!  Maybe I should delete usr/bin/firefox.exe? and run it again?

5
Applications / Re: Firefox 45.9 XUL.DLL error
« on: February 12, 2019, 10:42:14 pm »
I'm still stuck without the ability to run Firefox 45.9, I cant get it working with the latest updates to ANPM installed, and I can't downgrade libc and libcx. Is there any way of getting a copy of the .RPM version? I see now that supposedly it is only available to beta testers.

Thanks klipp

6
Applications / Re: Firefox 45.9 XUL.DLL error
« on: February 08, 2019, 01:47:00 am »
Hey Pete,Good to hear from you, Its been quite a while since you last bailed me out! Turns out I didn't have Netlabs-exp installed, so I installed it,- but no cigar. It upgraded libcx to 0.4.1, Should I maybe try 0.3.1?
Dave, Looking at popuplog.os2 it shows Firefox at the bottom of the list, but I don't see anything that gives an indication of version/build. What should I be looking for?
This is a pretty old version of 45.9, and I have no idea if I can re-install a newer version over it or not.
Thanks for the help guys!
Oh, One last thought, ANPM can't upgrade heimdal-libs package, its got bad problems, could that affect Firefox 45.9 maybe?

7
Applications / Firefox 45.9 XUL.DLL error
« on: February 07, 2019, 01:41:22 am »
I just finally got around to updatng ANPM's listed necessary updates and re-booted and now Firefox 45.9 throws the error "Couldn't load XUL.DLL (OS2 error 87). Any ideas as to what is needed to make Firefox work once again?
Thanks for any responses

klipp

8
Applications / Re: VirtualBox version 176 compiling/testing
« on: November 04, 2018, 05:59:21 pm »
2valerieus, I'm using iasl.exe from OSFree and the results are the same. I'm wondering, you are using gcc-wrc-4.9.2.1-3.oc00.pentieum. I'm using gcc-wrc-4.9.2-1-3.oc00.i686  Aparently there is a difference. Yum offers a gcc-wrc-4.9.2-1.oc00-i386 but not a pentieum version. The i386 version requires replacing pretty much all of gcc. Or are i386 and Pentienm the same thing possibly? 

klipp

9
Applications / Re: VirtualBox version 176 compiling/testing
« on: November 03, 2018, 07:25:04 pm »
2valerieus, New compile using r-177 (and the correct iasl.exe (533548 size). It progresses and completes the virtualbox.exe build, links & installs it, then decides there is something else wrong and deletes virtualbox.exe with the following error!

kBuild: Installing VBoxNetDHCP => L:/177-vbox/out/os2.x86/release/bin/VBoxNetDHC
P.exe
kBuild: Installing VBoxNetLwipNAT => L:/177-vbox/out/os2.x86/release/bin/VBoxNet
NAT.exe
kBuild: Installing VMMR0 => L:/177-vbox/out/os2.x86/release/bin/VMMR0.r0
kBuild: Installing VBoxDD => L:/177-vbox/out/os2.x86/release/bin/VBoxDD.dll

Reading binary resource file L:\177-vbox\out\os2.x86\release\obj\VirtualBox\src\
platform\os2\VirtualBox.res


(0) RC: error - Only integer TYPE allowed ().
RC: 1 error detected

kmk: *** [L:/177-vbox/out/os2.x86/release/obj/VirtualBox/VirtualBox.exe] Error 1

The failing command:
@g++.exe @L:/177-vbox/out/os2.x86/release/obj/VirtualBox/VirtualBox.rsp
kmk: *** Deleting file `L:/177-vbox/out/os2.x86/release/obj/VirtualBox/VirtualBo
x.exe'
kmk: *** [L:/177-vbox/out/os2.x86/release/obj/VirtualBox/VirtualBox.exe] Deletin
g file `L:/177-vbox/out/os2.x86/release/obj/VirtualBox/VirtualBox.map'
kmk: *** [L:/177-vbox/out/os2.x86/release/obj/VirtualBox/VirtualBox.exe] Deletin
g file `L:/177-vbox/out/os2.x86/release/obj/VirtualBox/VirtualBox.rsp'
#

I've seen this before but don't remember the fix.

klipp

10
Applications / Re: VirtualBox version 176 compiling/testing
« on: November 01, 2018, 08:37:14 pm »
2valerieus, I'm out of town, I'll try to get to it Saturday or Sunday!

klipp

11
Applications / Re: VirtualBox version 176 compiling/testing
« on: October 27, 2018, 01:16:53 am »
2valerieus, I must be missing something, tried what yousaid but still get these results on 2 different boxes, one running OS4 kernel and the other running IBM kernel.

kBuild: Pass - DLLs
kBuild: Compiling VBoxDD - L:/176-vbox/src/VBox/Devices/PC/ACPI/VBoxAcpi.cpp
In file included from L:/176-vbox/src/VBox/Devices/PC/ACPI/VBoxAcpi.cpp:45:0:
L:/176-vbox/out/os2.x86/release/obj/VBoxDD/vboxssdt-standard.hex:13:19: warning:
 extra tokens at end of #ifndef directive
 #ifndef __VBOXSSDT-STANDARD_HEX__
                   ^
L:/176-vbox/out/os2.x86/release/obj/VBoxDD/vboxssdt-standard.hex:14:19: warning:
 missing whitespace after the macro name
 #define __VBOXSSDT-STANDARD_HEX__
                   ^
In file included from L:/176-vbox/src/VBox/Devices/PC/ACPI/VBoxAcpi.cpp:46:0:
L:/176-vbox/out/os2.x86/release/obj/VBoxDD/vboxssdt-cpuhotplug.hex:13:19: warnin
g: extra tokens at end of #ifndef directive
 #ifndef __VBOXSSDT-CPUHOTPLUG_HEX__
                   ^
In file included from L:/176-vbox/src/VBox/Devices/PC/ACPI/VBoxAcpi.cpp:45:0:
L:/kBuild: Pass - Programs
176-vbox/out/os2.x86/release/obj/VBoxDD/vboxssdt-standard.hex:16:23: error: expe
cted initializer before '-' token
 unsigned char vboxssdt-standard_aml_code[] =
                       ^
L:/176-vbox/src/VBox/Devices/PC/ACPI/VBoxAcpi.cpp: In function 'int acpiPrepareD
sdt(PPDMDEVINS, void**, size_t*)':
L:/176-vbox/src/VBox/Devices/PC/ACPI/VBoxAcpi.cpp:371:32: error: 'AmlCode' was n
ot declared in this scope
         cbAmlCodeDsdt = sizeof(AmlCode);
                                ^
L:/176-vbox/src/VBox/Devices/PC/ACPI/VBoxAcpi.cpp: In function 'int acpiPrepareS
sdt(PPDMDEVINS, void**, size_t*)':
L:/176-vbox/src/VBox/Devices/PC/ACPI/VBoxAcpi.cpp:422:30: error: 'AmlCodeSsdtCpu
HotPlug' was not declared in this scope
             pabAmlCode     = AmlCodeSsdtCpuHotPlug;
                              ^
L:/176-vbox/src/VBox/Devices/PC/ACPI/VBoxAcpi.cpp:427:30: error: 'AmlCodeSsdtSta
ndard' was not declared in this scope
             pabAmlCode     = AmlCodeSsdtStandard;
                              ^
kmk: *** [L:/176-vbox/out/os2.x86/release/obj/VBoxDD/PC/ACPI/VBoxAcpi.o] Error 1

The failing command:
@g++.exe -c -Zomf -O2 -g -pipe -pedantic -Wshadow -Wshadow -Wall -Wextra -Wno-mi
ssing-field-initializers -Wno-unused -Wno-trigraphs -fdiagnostics-show-option -W
no-unused-parameter -Wlogical-op -Wno-long-long -Wno-long-long -Wno-delete-non-v
irtual-dtor -Wno-variadic-macros -march=i586 -O2 -mtune=generic -fno-omit-frame-
pointer -fno-strict-aliasing    -m32 -IL:/176-vbox/out/os2.x86/release/obj/VBoxD
D -IL:/176-vbox/src/VBox/HostDrivers/VBoxUSB/os2 -IL:/176-vbox/src/VBox/Devices/
build -IL:/176-vbox/src/VBox/Devices/Network/slirp -IL:/176-vbox/out/os2.x86/rel
ease/obj/VBoxDD/dtrace -IL:/176-vbox/include -IL:/176-vbox/out/os2.x86/release -
DVBOX -DVBOX_OSE -DVBOX_WITH_64_BITS_GUESTS -DVBOX_WITH_DEBUGGER -DRT_OS_OS2 -D_
_OS2__ -DRT_ARCH_X86 -D__X86__ -DIN_RING3 -DHC_ARCH_BITS=32 -DGC_ARCH_BITS=64 -D
VBOX_ACPI -DVBOX_HGCM_HOST_CODE -DVBOX_WITH_HGCM -DVBOX_WITH_DMI_CHASSIS -DVBOX_
WITH_DMI_OEMSTRINGS -DVBOXWDDM_WITH_VBVA -DVBOX_WITH_HGSMI -DVBOX_WITH_WDDM -DVB
OX_WITH_VMSVGA -DVBOX_WITH_VDMA -DVBOX_WITH_PXE_ROM -DVBOX_WITH_USB -DVBOX_WITH_
VUSB -DVBOX_WITH_INIP -DVBOX_WITH_E1000 -DVBOX_WITH_VIRTIO -DVBOX_WITH_UDPTUNNEL
 -DVBOX_WITH_NETSHAPER -DVBOX_WITH_AHCI -DIN_AHCI_R3 -DVBOX_WITH_BUSLOGIC -DVBOX
_WITH_LSILOGIC -DVBOX_WITH_PDM_ASYNC_COMPLETION -DVBOX_WITH_SCSI -DVBOX_WITH_EFI
 -DVBOX_WITH_MSI_DEVICES -DVBOX_WITH_NEW_PS2M -DVUSB_HAVE_USBPROXY_DEVICE -Wp,-M
D,L:/176-vbox/out/os2.x86/release/obj/VBoxDD/PC/ACPI/VBoxAcpi.o.dep -Wp,-MT,L:/1
76-vbox/out/os2.x86/release/obj/VBoxDD/PC/ACPI/VBoxAcpi.o -Wp,-MP -o L:/176-vbox
/out/os2.x86/release/obj/VBoxDD/PC/ACPI/VBoxAcpi.o L:/176-vbox/src/VBox/Devices/
PC/ACPI/VBoxAcpi.cpp
#

Guess I'll wait till you have some time to look into it further.

Thanks klipp

12
Applications / Re: VirtualBox version 176 compiling/testing
« on: October 26, 2018, 11:01:00 pm »
2valerieus: No not strange, you told me about this fix a year ago and I wasn't smart enough to remember it.  It allows the compile to continue until this in Wraps:

kBuild: Compiling VBoxDD - L:/176-vbox/src/VBox/Devices/PC/ACPI/VBoxAcpi.cpp
kBuild: Compiling VBoxDbg - L:/176-vbox/out/os2.x86/release/obj/VBoxDbg/qtmoc/V
oxDbgStatsQt4.cpp
kBuild: Linking VBoxHlp
In file included from L:/176-vbox/src/VBox/Devices/PC/ACPI/VBoxAcpi.cpp:45:0:
L:/176-vbox/out/os2.x86/release/obj/VBoxDD/vboxssdt-standard.hex:13:19: warning
 extra tokens at end of #ifndef directive
 #ifndef __VBOXSSDT-STANDARD_HEX__
                   ^
L:/176-vbox/out/os2.x86/release/obj/VBoxDD/vboxssdt-standard.hex:14:19: warning
 missing whitespace after the macro name
 #define __VBOXSSDT-STANDARD_HEX__
                   ^
In file included from L:/176-vbox/src/VBox/Devices/PC/ACPI/VBoxAcpi.cpp:46:0:
L:/176-vbox/out/os2.x86/release/obj/VBoxDD/vboxssdt-cpuhotplug.hex:13:19: warni
g: extra tokens at end of #ifndef directive
 #ifndef __VBOXSSDT-CPUHOTPLUG_HEX__
                   ^
kBuild: Compiling VBoxXPCOMIPCC - L:/176-vbox/src/libs/xpcom18a4/ipc/ipcd/clien
/src/ipcdclient.cpp
kBuild: Compiling VBoxXPCOMIPCC - L:/176-vbox/src/libs/xpcom18a4/ipc/ipcd/clien
/src/ipcService.cpp
In file included from L:/176-vbox/src/VBox/Devices/PC/ACPI/VBoxAcpi.cpp:45:0:
L:/176-vbox/out/os2.x86/release/obj/VBoxDD/vboxssdt-standard.hex:16:23: error:
xpected initializer before '-' token
 unsigned char vboxssdt-standard_aml_code[] =
                       ^
L:/176-vbox/src/VBox/Devices/PC/ACPI/VBoxAcpi.cpp: In function 'int acpiPrepare
sdt(PPDMDEVINS, void**, size_t*)':
L:/176-vbox/src/VBox/Devices/PC/ACPI/VBoxAcpi.cpp:371:32: error: 'AmlCode' was
ot declared in this scope
         cbAmlCodeDsdt = sizeof(AmlCode);
                                ^
L:/176-vbox/src/VBox/Devices/PC/ACPI/VBoxAcpi.cpp: In function 'int acpiPrepare
sdt(PPDMDEVINS, void**, size_t*)':
L:/176-vbox/src/VBox/Devices/PC/ACPI/VBoxAcpi.cpp:422:30: error: 'AmlCodeSsdtCp
HotPlug' was not declared in this scope
             pabAmlCode     = AmlCodeSsdtCpuHotPlug;
                              ^
L:/176-vbox/src/VBox/Devices/PC/ACPI/VBoxAcpi.cpp:427:30: error: 'AmlCodeSsdtSt
ndard' was not declared in this scope
             pabAmlCode     = AmlCodeSsdtStandard;
                              ^
kmk: *** [L:/176-vbox/out/os2.x86/release/obj/VBoxDD/PC/ACPI/VBoxAcpi.o] Error

The failing command:
@g++.exe -c -Zomf -O2 -g -pipe -pedantic -Wshadow -Wshadow -Wall -Wextra -Wno-m
ssing-field-initializers -Wno-unused -Wno-trigraphs -fdiagnostics-show-option -
no-unused-parameter -Wlogical-op -Wno-long-long -Wno-long-long -Wno-delete-non-
irtual-dtor -Wno-variadic-macros -march=i586 -O2 -mtune=generic -fno-omit-frame
pointer -fno-strict-aliasing    -m32 -IL:/176-vbox/out/os2.x86/release/obj/VBox
D -IL:/176-vbox/src/VBox/HostDrivers/VBoxUSB/os2 -IL:/176-vbox/src/VBox/Devices
build -IL:/176-vbox/src/VBox/Devices/Network/slirp -IL:/176-vbox/out/os2.x86/re
ease/obj/VBoxDD/dtrace -IL:/176-vbox/include -IL:/176-vbox/out/os2.x86/release
DVBOX -DVBOX_OSE -DVBOX_WITH_64_BITS_GUESTS -DVBOX_WITH_DEBUGGER -DRT_OS_OS2 -D
_OS2__ -DRT_ARCH_X86 -D__X86__ -DIN_RING3 -DHC_ARCH_BITS=32 -DGC_ARCH_BITS=64 -
VBOX_ACPI -DVBOX_HGCM_HOST_CODE -DVBOX_WITH_HGCM -DVBOX_WITH_DMI_CHASSIS -DVBOX
WITH_DMI_OEMSTRINGS -DVBOXWDDM_WITH_VBVA -DVBOX_WITH_HGSMI -DVBOX_WITH_WDDM -DV
OX_WITH_VMSVGA -DVBOX_WITH_VDMA -DVBOX_WITH_PXE_ROM -DVBOX_WITH_USB -DVBOX_WITH
VUSB -DVBOX_WITH_INIP -DVBOX_WITH_E1000 -DVBOX_WITH_VIRTIO -DVBOX_WITH_UDPTUNNE
 -DVBOX_WITH_NETSHAPER -DVBOX_WITH_AHCI -DIN_AHCI_R3 -DVBOX_WITH_BUSLOGIC -DVBO
_WITH_LSILOGIC -DVBOX_WITH_PDM_ASYNC_COMPLETION -DVBOX_WITH_SCSI -DVBOX_WITH_EF
 -DVBOX_WITH_MSI_DEVICES -DVBOX_WITH_NEW_PS2M -DVUSB_HAVE_USBPROXY_DEVICE -Wp,-
D,L:/176-vbox/out/os2.x86/release/obj/VBoxDD/PC/ACPI/VBoxAcpi.o.dep -Wp,-MT,L:/
76-vbox/out/os2.x86/release/obj/VBoxDD/PC/ACPI/VBoxAcpi.o -Wp,-MP -o L:/176-vbo
/out/os2.x86/release/obj/VBoxDD/PC/ACPI/VBoxAcpi.o L:/176-vbox/src/VBox/Devices
PC/ACPI/VBoxAcpi.cpp
kmk: *** Waiting for unfinished jobs....
kmk: *** Exiting with status 2
#

Is this the Trunk problem that remains to be fixed?

Thanks klipp

13
Applications / VirtualBox version 176 compiling/testing
« on: October 25, 2018, 11:31:10 pm »
@valerieus r176 on Netlabs won't compile for me using either OS4 kernel or IBM's  It gets to VBoxDD and fails on VBoxAcpi.o!

L:/176-vbox/src/VBox/Devices/PC/ACPI/VBoxAcpi.cpp:427:30: error: 'AmlCodeSsdtSta
ndard' was not declared in this scope
             pabAmlCode     = AmlCodeSsdtStandard;
                              ^
kmk: *** [L:/176-vbox/out/os2.x86/release/obj/VBoxDD/PC/ACPI/VBoxAcpi.o] Error 1

The failing command:
@g++.exe -c -Zomf -O2 -g -pipe -pedantic -Wshadow -Wshadow -Wall -Wextra -Wno-mi
ssing-field-initializers -Wno-unused -Wno-trigraphs -fdiagnostics-show-option -W
no-unused-parameter -Wlogical-op -Wno-long-long -Wno-long-long -Wno-delete-non-v
irtual-dtor -Wno-variadic-macros -march=i586 -O2 -mtune=generic -fno-omit-frame-
pointer -fno-strict-aliasing    -m32 -IL:/176-vbox/out/os2.x86/release/obj/VBoxD
D -IL:/176-vbox/src/VBox/HostDrivers/VBoxUSB/os2 -IL:/176-vbox/src/VBox/Devices/
build -IL:/176-vbox/src/VBox/Devices/Network/slirp -IL:/176-vbox/out/os2.x86/rel
ease/obj/VBoxDD/dtrace -IL:/176-vbox/include -IL:/176-vbox/out/os2.x86/release -
DVBOX -DVBOX_OSE -DVBOX_WITH_64_BITS_GUESTS -DVBOX_WITH_DEBUGGER -DRT_OS_OS2 -D_
_OS2__ -DRT_ARCH_X86 -D__X86__ -DIN_RING3 -DHC_ARCH_BITS=32 -DGC_ARCH_BITS=64 -D
VBOX_ACPI -DVBOX_HGCM_HOST_CODE -DVBOX_WITH_HGCM -DVBOX_WITH_DMI_CHASSIS -DVBOX_
WITH_DMI_OEMSTRINGS -DVBOXWDDM_WITH_VBVA -DVBOX_WITH_HGSMI -DVBOX_WITH_WDDM -DVB
OX_WITH_VMSVGA -DVBOX_WITH_VDMA -DVBOX_WITH_PXE_ROM -DVBOX_WITH_USB -DVBOX_WITH_
VUSB -DVBOX_WITH_INIP -DVBOX_WITH_E1000 -DVBOX_WITH_VIRTIO -DVBOX_WITH_UDPTUNNEL
 -DVBOX_WITH_NETSHAPER -DVBOX_WITH_AHCI -DIN_AHCI_R3 -DVBOX_WITH_BUSLOGIC -DVBOX
_WITH_LSILOGIC -DVBOX_WITH_PDM_ASYNC_COMPLETION -DVBOX_WITH_SCSI -DVBOX_WITH_EFI
 -DVBOX_WITH_MSI_DEVICES -DVBOX_WITH_NEW_PS2M -DVUSB_HAVE_USBPROXY_DEVICE -Wp,-M
D,L:/176-vbox/out/os2.x86/release/obj/VBoxDD/PC/ACPI/VBoxAcpi.o.dep -Wp,-MT,L:/1
76-vbox/out/os2.x86/release/obj/VBoxDD/PC/ACPI/VBoxAcpi.o -Wp,-MP -o L:/176-vbox
/out/os2.x86/release/obj/VBoxDD/PC/ACPI/VBoxAcpi.o L:/176-vbox/src/VBox/Devices/
PC/ACPI/VBoxAcpi.cpp
kmk: *** Waiting for unfinished jobs....
kmk: *** Exiting with status 2
#

Have I missed  including something?

Thanks   klipp.

14
Applications / Re: VirtualBox v5.0.51 Testing
« on: October 21, 2018, 08:50:36 pm »
valerius, I'm trying to get kernel r5283 but it looks like www.gus.biysk.ru is  not reachable, there used to be another site where you could download  OS4 SVN's  bit I lost that during my last H.D. crash. Any ideas as to where I can get it?

Thanks klipp

15
Applications / Re: VirtualBox v5.0.51 Testing
« on: October 18, 2018, 02:28:12 am »
O.K. Thanks valerius. I'm for now only set up to use OS4 kernel and ArcaOS 5.0.3. I'll set up on another machine using OS4 kernel and ArcaOS 5.0.2 or 5.0.1 and see what happens  there.
Another question, Will all future releases of VBox be available on you're site and no longer on Netlabs?

klipp

Pages: [1] 2 3 ... 17